{"text_format":"1","workbook":"xlsx","n_sheets":4,"sheets":["Sheet1","Sheet1 (2)","HSC","HSC (2)"],"not_rendered":{"charts":3,"images":0,"macros":0,"external_links":1,"defined_names":1,"comments":0,"pivot_tables":4},"unopened":[],"bounds":{"document_bytes":16777216,"sheet_cells":100000,"rows_first":2000,"rows_last":500,"rows_between":2000,"halvings":0,"cell_chars":16384,"cell_head_chars":4096},"cells_cut":0,"cells_raw":0,"read":"whole","date_system":"1900"}

{"sheet":"Sheet1","index":0,"n_rows":462,"n_cols":10,"rows_kept":462,"cut":false,"hidden":false,"merged":[]}
["Team","(All)"]
["Name","Adam.Henrique"]
[]
["Row Labels"," TOI/Gm","Average of CF%","Average of HSCF%",null,null," TOI/Gm"," G60"," A60"," P60"]
["2011-04-10",11.6,48.7,100]
["2011-10-08",8.3000000000000007,19.7,{"$error":"#DIV/0!"}]
["2011-10-10",5.5,60.3,100]
["2011-10-22",13.7,23.8,41.8]
["2011-10-25",12.7,62.8,40.200000000000003]
["2011-10-27",14.9,52.2,100]
["2011-10-29",9.4,54.1,100]
["2011-11-02",12.5,35.200000000000003,44.6]
["2011-11-03",13,61.2,51.5]
["2011-11-05",19,27.9,65.400000000000006]
["2011-11-08",14.9,53,52.6]
["2011-11-11",12.3,48,40.4]
["2011-11-12",14.4,38.4,74.099999999999994]
["2011-11-15",13.5,38.4,40.299999999999997]
["2011-11-16",13.9,40.4,0]
["2011-11-19",11.3,36.6,0]
["2011-11-21",14.8,43.9,31.7]
["2011-11-23",13.4,56.9,33.799999999999997]
["2011-11-25",16.2,63,69.3]
["2011-11-26",13.3,48.6,36.9,null,null,{"$f":"AVERAGE(B5:B24)","v":12.930000000000001},{"$f":"AVERAGE(C5:C24)","v":45.654999999999994},{"$error":"#DIV/0!"},{"$error":"#DIV/0!"}]
["2011-11-30",13,42.3,40.200000000000003,null,null,{"$f":"AVERAGE(B6:B25)","v":13.000000000000004},{"$f":"AVERAGE(C6:C25)","v":45.334999999999994},{"$f":"AVERAGE(D6:D25)","v":{"$error":"#DIV/0!"}},{"$f":"AVERAGE(E6:E25)","v":{"$error":"#DIV/0!"}}]
["2011-12-02",15.6,69.8,56.6,null,null,13.365,47.839999999999989,50.97,{"$error":"#DIV/0!"}]
["2011-12-03",15.1,70.8,0,null,null,13.845000000000002,48.364999999999995,45.97,{"$error":"#DIV/0!"}]
["2011-12-06",14.4,31.8,0,null,null,13.88,48.764999999999986,43.88,{"$error":"#DIV/0!"}]
["2011-12-08",15.8,35.299999999999997,100,null,null,14.035000000000002,47.389999999999986,46.87,{"$error":"#DIV/0!"}]
["2011-12-10",12.5,52,100,null,null,13.915000000000001,47.379999999999981,46.87,{"$error":"#DIV/0!"}]
["2011-12-12",14.6,72.7,69.2,null,null,14.175000000000002,48.309999999999988,45.330000000000005,{"$error":"#DIV/0!"}]
["2011-12-13",15.7,71.7,81.2,null,null,14.334999999999999,50.134999999999991,47.160000000000011,{"$error":"#DIV/0!"}]
["2011-12-16",13.2,61.1,50.2,null,null,14.344999999999999,50.129999999999995,47.095000000000006,{"$error":"#DIV/0!"}]
["2011-12-17",15,72.5,40.700000000000003,null,null,14.145,52.359999999999992,45.860000000000007,{"$error":"#DIV/0!"}]
["2011-12-20",14,39,30.6,null,null,14.1,51.660000000000004,44.760000000000005,{"$error":"#DIV/0!"}]
["2011-12-23",14.6,53.2,40.200000000000003,null,null,14.215,51.92,44.750000000000014,{"$error":"#DIV/0!"}]
["2011-12-26",13.1,51.8,38.299999999999997,null,null,14.15,52.590000000000011,42.960000000000008,{"$error":"#DIV/0!"}]
["2011-12-28",13.5,67.400000000000006,43.5,null,null,14.15,54.040000000000006,43.120000000000012,{"$error":"#DIV/0!"}]
["2011-12-31",9.4,45.6,31.4,null,null,13.924999999999997,54.3,44.690000000000012,{"$error":"#DIV/0!"}]
["2012-01-02",14.3,37.1,42.2,null,null,14.074999999999998,54.325000000000003,46.800000000000011,{"$error":"#DIV/0!"}]
["2012-01-04",14.6,40.9,56.6,null,null,14.065000000000001,54.175000000000011,48.045000000000002,{"$error":"#DIV/0!"}]
["2012-01-06",12.9,37.4,62.6,null,null,14.039999999999997,53.20000000000001,49.485000000000007,{"$error":"#DIV/0!"}]
["2012-01-07",15.2,49.9,60.5,null,null,13.989999999999998,52.545000000000002,49.045000000000002,{"$error":"#DIV/0!"}]
["2012-01-10",11.3,90.6,74,null,null,13.89,54.644999999999996,50.900000000000006,{"$error":"#DIV/0!"}]
["2012-01-11",20.9,38,36.6,null,null,14.285,54.429999999999993,50.720000000000006,{"$error":"#DIV/0!"}]
["2012-01-19",14.6,44.8,100,null,null,14.235000000000003,53.179999999999993,52.890000000000008,{"$error":"#DIV/0!"}]
["2012-01-21",12.6,58.9,29,null,null,14.110000000000003,52.585000000000001,54.340000000000011,{"$error":"#DIV/0!"}]
["2012-01-24",16.8,60.3,56.4,null,null,14.23,54.010000000000005,57.160000000000011,{"$error":"#DIV/0!"}]
["2012-02-05",14.3,54.7,79.5,null,null,14.155000000000001,54.98,56.135000000000005,{"$error":"#DIV/0!"}]
["2012-02-07",15,59,58.9,null,null,14.280000000000001,55.33,54.080000000000005,{"$error":"#DIV/0!"}]
["2012-02-09",11.9,53.9,{"$error":"#DIV/0!"},null,null,14.145,54.390000000000008,{"$error":"#DIV/0!"},{"$error":"#DIV/0!"}]
["2012-02-11",15.3,57.3,54.4,null,null,14.125,53.669999999999995,{"$error":"#DIV/0!"},{"$error":"#DIV/0!"}]
["2012-02-14",14.5,64.3,70.8,null,null,14.190000000000001,53.83,{"$error":"#DIV/0!"},{"$error":"#DIV/0!"}]
["2012-02-17",14.4,41.1,49.9,null,null,14.160000000000002,52.259999999999991,{"$error":"#DIV/0!"},{"$error":"#DIV/0!"}]
["2012-02-19",15.9,40.200000000000003,100,null,null,14.255000000000001,52.319999999999993,{"$error":"#DIV/0!"},{"$error":"#DIV/0!"}]
["2012-02-21",17.8,64,80.400000000000006,null,null,14.415000000000001,52.859999999999992,{"$error":"#DIV/0!"},{"$error":"#DIV/0!"}]
["2012-02-24",20.2,52.3,74.400000000000006,null,null,14.770000000000001,52.885000000000005,{"$error":"#DIV/0!"},{"$error":"#DIV/0!"}]
["2012-02-26",14.1,51.5,54.5,null,null,14.800000000000002,52.089999999999996,{"$error":"#DIV/0!"},{"$error":"#DIV/0!"}]
["2012-02-27",15.3,64.2,63.4,null,null,15.095000000000004,53.019999999999996,{"$error":"#DIV/0!"},{"$error":"#DIV/0!"}]
["2012-03-01",14.1,62.1,77.599999999999994,null,null,15.085000000000004,54.269999999999996,{"$error":"#DIV/0!"},{"$error":"#DIV/0!"}]
{"$rows_left_out":403}
{"sheet":"Sheet1 (2)","index":1,"n_rows":462,"n_cols":10,"rows_kept":462,"cut":false,"hidden":false,"merged":[]}
["Team","(All)"]
["Name","Adam.Henrique"]
[]
["Row Labels"," TOI/Gm","Average of PSh%","Average of OSh%",null,null," TOI/Gm","Average of PSh%","Average of OSh%"," P60"]
["2011-04-10",11.6,{"$error":"#DIV/0!"},20.9]
["2011-10-08",8.3000000000000007,{"$error":"#DIV/0!"},0]
["2011-10-10",5.5,0,0]
["2011-10-22",13.7,0,0]
["2011-10-25",12.7,0,0]
["2011-10-27",14.9,0,15.4]
["2011-10-29",9.4,0,0]
["2011-11-02",12.5,0,0]
["2011-11-03",13,33.299999999999997,19.399999999999999]
["2011-11-05",19,100,16.899999999999999]
["2011-11-08",14.9,50,11.7]
["2011-11-11",12.3,{"$error":"#DIV/0!"},0]
["2011-11-12",14.4,{"$error":"#DIV/0!"},0]
["2011-11-15",13.5,0,35.1]
["2011-11-16",13.9,{"$error":"#DIV/0!"},32.700000000000003]
["2011-11-19",11.3,0,0]
["2011-11-21",14.8,0,15.2]
["2011-11-23",13.4,0,0]
["2011-11-25",16.2,0,0]
["2011-11-26",13.3,33.299999999999997,24.5,null,null,{"$f":"AVERAGE(B5:B24)","v":12.930000000000001},{"$f":"AVERAGE(C5:C24)","v":{"$error":"#DIV/0!"}},9.59,{"$error":"#DIV/0!"}]
["2011-11-30",13,0,21.8,null,null,{"$f":"AVERAGE(B6:B25)","v":13.000000000000004},{"$error":"#DIV/0!"},9.6349999999999998,{"$error":"#DIV/0!"}]
["2011-12-02",15.6,0,13.2,null,null,13.365,{"$error":"#DIV/0!"},10.294999999999998,{"$error":"#DIV/0!"}]
["2011-12-03",15.1,50,25.5,null,null,13.845000000000002,{"$error":"#DIV/0!"},11.569999999999999,{"$error":"#DIV/0!"}]
["2011-12-06",14.4,{"$error":"#DIV/0!"},0,null,null,13.88,{"$error":"#DIV/0!"},11.569999999999999,{"$error":"#DIV/0!"}]
["2011-12-08",15.8,0,18.399999999999999,null,null,14.035000000000002,{"$error":"#DIV/0!"},12.489999999999998,{"$error":"#DIV/0!"}]
["2011-12-10",12.5,0,0,null,null,13.915000000000001,{"$error":"#DIV/0!"},11.72,{"$error":"#DIV/0!"}]
["2011-12-12",14.6,{"$error":"#DIV/0!"},48.6,null,null,14.175000000000002,{"$error":"#DIV/0!"},14.15,{"$error":"#DIV/0!"}]
["2011-12-13",15.7,0,8.1,null,null,14.334999999999999,{"$error":"#DIV/0!"},14.555000000000001,{"$error":"#DIV/0!"}]
["2011-12-16",13.2,{"$error":"#DIV/0!"},24.5,null,null,14.344999999999999,{"$error":"#DIV/0!"},14.810000000000002,{"$error":"#DIV/0!"}]
["2011-12-17",15,0,8.8000000000000007,null,null,14.145,{"$error":"#DIV/0!"},14.404999999999998,{"$error":"#DIV/0!"}]
["2011-12-20",14,0,0,null,null,14.1,{"$error":"#DIV/0!"},13.820000000000002,{"$error":"#DIV/0!"}]
["2011-12-23",14.6,33.299999999999997,12.5,null,null,14.215,{"$error":"#DIV/0!"},14.445000000000002,{"$error":"#DIV/0!"}]
["2011-12-26",13.1,33.299999999999997,25.8,null,null,14.15,{"$error":"#DIV/0!"},15.735000000000003,{"$error":"#DIV/0!"}]
["2011-12-28",13.5,0,17.3,null,null,14.15,{"$error":"#DIV/0!"},14.845000000000002,{"$error":"#DIV/0!"}]
["2011-12-31",9.4,{"$error":"#DIV/0!"},0,null,null,13.924999999999997,{"$error":"#DIV/0!"},13.209999999999999,{"$error":"#DIV/0!"}]
["2012-01-02",14.3,0,0,null,null,14.074999999999998,{"$error":"#DIV/0!"},13.209999999999999,{"$error":"#DIV/0!"}]
["2012-01-04",14.6,{"$error":"#DIV/0!"},0,null,null,14.065000000000001,{"$error":"#DIV/0!"},12.450000000000001,{"$error":"#DIV/0!"}]
["2012-01-06",12.9,0,0,null,null,14.039999999999997,{"$error":"#DIV/0!"},12.450000000000001,{"$error":"#DIV/0!"}]
["2012-01-07",15.2,0,15,null,null,13.989999999999998,{"$error":"#DIV/0!"},13.2,{"$error":"#DIV/0!"}]
["2012-01-10",11.3,0,9,null,null,13.89,{"$error":"#DIV/0!"},12.425000000000001,{"$error":"#DIV/0!"}]
["2012-01-11",20.9,0,0,null,null,14.285,{"$error":"#DIV/0!"},11.335000000000003,{"$error":"#DIV/0!"}]
["2012-01-19",14.6,{"$error":"#DIV/0!"},0,null,null,14.235000000000003,{"$error":"#DIV/0!"},10.675000000000001,{"$error":"#DIV/0!"}]
["2012-01-21",12.6,0,0,null,null,14.110000000000003,{"$error":"#DIV/0!"},9.4,{"$error":"#DIV/0!"}]
["2012-01-24",16.8,0,0,null,null,14.23,{"$error":"#DIV/0!"},9.4,{"$error":"#DIV/0!"}]
["2012-02-05",14.3,0,13.6,null,null,14.155000000000001,{"$error":"#DIV/0!"},9.16,{"$error":"#DIV/0!"}]
["2012-02-07",15,0,0,null,null,14.280000000000001,{"$error":"#DIV/0!"},9.16,{"$error":"#DIV/0!"}]
["2012-02-09",11.9,33.299999999999997,14.4,null,null,14.145,{"$error":"#DIV/0!"},7.45,{"$error":"#DIV/0!"}]
["2012-02-11",15.3,0,0,null,null,14.125,{"$error":"#DIV/0!"},7.044999999999999,{"$error":"#DIV/0!"}]
["2012-02-14",14.5,{"$error":"#DIV/0!"},14.2,null,null,14.190000000000001,{"$error":"#DIV/0!"},6.5299999999999994,{"$error":"#DIV/0!"}]
["2012-02-17",14.4,100,17,null,null,14.160000000000002,{"$error":"#DIV/0!"},6.94,{"$error":"#DIV/0!"}]
["2012-02-19",15.9,{"$error":"#DIV/0!"},15.3,null,null,14.255000000000001,{"$error":"#DIV/0!"},7.705000000000001,{"$error":"#DIV/0!"}]
["2012-02-21",17.8,0,5.2,null,null,14.415000000000001,{"$error":"#DIV/0!"},7.339999999999999,{"$error":"#DIV/0!"}]
["2012-02-24",20.2,0,0,null,null,14.770000000000001,{"$error":"#DIV/0!"},6.05,{"$error":"#DIV/0!"}]
["2012-02-26",14.1,{"$error":"#DIV/0!"},0,null,null,14.800000000000002,{"$error":"#DIV/0!"},5.1850000000000005,{"$error":"#DIV/0!"}]
["2012-02-27",15.3,0,0,null,null,15.095000000000004,{"$error":"#DIV/0!"},5.1850000000000005,{"$error":"#DIV/0!"}]
["2012-03-01",14.1,{"$error":"#DIV/0!"},0,null,null,15.085000000000004,{"$error":"#DIV/0!"},5.1850000000000005,{"$error":"#DIV/0!"}]
{"$rows_left_out":403}
{"sheet":"HSC","index":2,"n_rows":887,"n_cols":10,"rows_kept":887,"cut":false,"hidden":false,"merged":[]}
["Team","(All)"]
["Name","Steven.Stamkos"]
[]
["Row Labels"," HSCF"," iHSC"," HSCF%Rel"," G60",null," HSCF"," iHSC"," HSCF%Rel"," G60"]
["2008-10-04",2.6,3,55.8,0]
["2008-10-05",0,0,-39.5,0]
["2008-10-11",0,0,-29.1,0]
["2008-10-16",0.9,0,-36.4,0]
["2008-10-18",3.6,0,0,0]
["2008-10-21",2,1,-12.6,0]
["2008-10-25",0.9,1,-0.3,0]
["2008-10-28",1,0,-8.6,0]
["2008-10-30",2.1,1,-10.4,5.8]
["2008-11-01",0.9,1,-39.299999999999997,0]
["2008-11-05",1,1,-1.1000000000000001,0]
["2008-11-06",1.8,0,19.7,0]
["2008-11-08",2.2000000000000002,1,17.3,0]
["2008-11-10",3,1,-6.9,0]
["2008-11-12",0,0,-56.1,0]
["2008-11-13",0.8,1,-5.7,0]
["2008-11-16",1.1000000000000001,0,21.1,0]
["2008-11-18",6.9,3,24.1,0]
["2008-11-21",2.7,2,-7.9,0]
["2008-11-23",1.7,1,23.6,0,null,{"$f":"AVERAGE(B5:B24)","v":1.7600000000000005},{"$f":"AVERAGE(C5:C24)","v":0.85},-4.6150000000000002,0.28999999999999998]
["2008-11-26",0,0,-57.9,0,null,{"$f":"AVERAGE(B6:B25)","v":1.6300000000000001},0.7,-10.3,0.28999999999999998]
["2008-11-28",0,0,-54.4,0,null,1.6300000000000001,0.7,-11.045,0.28999999999999998]
["2008-11-29",0.8,0,-25.8,0,null,1.67,0.7,-10.88,0.28999999999999998]
["2008-12-02",1,0,-29.7,0,null,1.675,0.7,-10.544999999999998,0.28999999999999998]
["2008-12-04",1.8,0,-15.5,0,null,1.5850000000000002,0.7,-11.319999999999999,0.28999999999999998]
["2008-12-06",0.9,1,-55.3,0,null,1.53,0.7,-13.455000000000002,0.28999999999999998]
["2008-12-08",0,0,-64.599999999999994,0,null,1.4849999999999999,0.65,-16.669999999999998,0.28999999999999998]
["2008-12-10",3,2,6.5,0,null,1.585,0.75,-15.914999999999997,0.28999999999999998]
["2008-12-11",1,0,-10.199999999999999,0,null,1.53,0.7,-15.904999999999998,0]
["2008-12-13",1.4,1,51.3,0,null,1.5549999999999999,0.7,-11.375,0]
["2008-12-18",0,0,-49.8,0,null,1.5049999999999999,0.65,-13.809999999999999,0]
["2008-12-20",2.2000000000000002,1,10,0,null,1.5249999999999999,0.7,-14.294999999999996,0]
["2008-12-23",0,0,{"$error":"#DIV/0!"},0,null,1.4149999999999998,0.65,{"$error":"#DIV/0!"},0]
["2008-12-26",3.1,2,6.8,0,null,1.42,0.7,{"$error":"#DIV/0!"},0]
["2008-12-27",2.9,1,-4.5999999999999996,6.8,null,1.5649999999999999,0.75,{"$error":"#DIV/0!"},0.33999999999999997]
["2008-12-30",0.8,0,79.5,0,null,1.5649999999999999,0.7,{"$error":"#DIV/0!"},0.33999999999999997]
["2009-01-01",3.9,1,22.4,0,null,1.7050000000000001,0.75,{"$error":"#DIV/0!"},0.33999999999999997]
["2009-01-03",0,0,{"$error":"#DIV/0!"},0,null,1.3599999999999999,0.6,{"$error":"#DIV/0!"},0.33999999999999997]
["2009-01-04",0.9,0,40.200000000000003,0,null,1.27,0.5,{"$error":"#DIV/0!"},0.33999999999999997]
["2009-01-08",3.1,2,7.5,0,null,1.34,0.55000000000000004,{"$error":"#DIV/0!"},0.33999999999999997]
["2009-01-12",0,0,-44,0,null,1.34,0.55000000000000004,{"$error":"#DIV/0!"},0.33999999999999997]
["2009-01-13",1,1,13.2,5.3,null,1.3900000000000001,0.6,{"$error":"#DIV/0!"},0.60499999999999998]
["2009-01-15",1.7,1,-0.8,0,null,1.4350000000000001,0.65,{"$error":"#DIV/0!"},0.60499999999999998]
["2009-01-19",3,2,14.4,5.7,null,1.5349999999999999,0.75,{"$error":"#DIV/0!"},0.89]
["2009-01-21",0,0,{"$error":"#DIV/0!"},0,null,1.4449999999999998,0.75,{"$error":"#DIV/0!"},0.89]
["2009-01-27",2,0,12.3,0,null,1.5,0.7,{"$error":"#DIV/0!"},0.89]
["2009-01-30",0,0,-51.6,0,null,1.5,0.7,{"$error":"#DIV/0!"},0.89]
["2009-02-03",1,0,-14.8,0,null,1.4,0.6,{"$error":"#DIV/0!"},0.89]
["2009-02-04",0,0,-54.3,0,null,1.35,0.6,{"$error":"#DIV/0!"},0.89]
["2009-02-07",1.9,0,-25.5,0,null,1.375,0.55000000000000004,{"$error":"#DIV/0!"},0.89]
["2009-02-10",1.8,0,56.8,0,null,1.4650000000000001,0.55000000000000004,{"$error":"#DIV/0!"},0.89]
["2009-02-12",2.6,3,-5.3,0,null,1.4849999999999999,0.65,{"$error":"#DIV/0!"},0.89]
["2009-02-14",1.8,1,14.2,0,null,1.575,0.7,{"$error":"#DIV/0!"},0.89]
["2009-02-17",0,0,-59.6,0,null,1.42,0.6,{"$error":"#DIV/0!"},0.89]
["2009-02-19",0.9,1,-50.2,0,null,1.3199999999999998,0.6,{"$error":"#DIV/0!"},0.55000000000000004]
["2009-02-20",0,0,-37.5,0,null,1.28,0.6,{"$error":"#DIV/0!"},0.55000000000000004]
{"$rows_left_out":828}
{"sheet":"HSC (2)","index":3,"n_rows":492,"n_cols":22,"rows_kept":492,"cut":false,"hidden":false,"merged":[]}
[null,null,null,null,null,null,null,"stuff","Game ID","Team","Date","CF","iCF","TOI","SF%Rel","CF%Rel"]
[null,null,null,null,null,null,null,"L.A20004",20004,"L.A",{"$f":"VLOOKUP(H2,[1]Sheet5!$N:$Q,4,FALSE)","v":"2015-10-07"},6.6,1,13.9,9.1,-2.4,null,19.7,5,25.1,-12.8,-5.8]
[null,null,null,null,null,null,null,"L.A20045",20045,"L.A",{"$f":"VLOOKUP(H3,[1]Sheet5!$N:$Q,4,FALSE)","v":"2015-10-13"},18.8,4,18.8,24.4,9.8000000000000007,null,17.600000000000001,4,23.2,8.1999999999999993,10.8]
["Row Labels","Average of CF","Average of iCF","Average of TOI","Average of SF%Rel","Average of CF%Rel",null,"L.A20064",20064,"L.A",{"$f":"VLOOKUP(H4,[1]Sheet5!$N:$Q,4,FALSE)","v":"2015-10-16"},20.3,5,17.600000000000001,4.0999999999999996,-0.3,null,23.4,6,27.4,-2.7,18.899999999999999]
["Erik.Karlsson",19.000000000000011,4.5893223819301845,19.123819301848062,3.2129363449691986,4.3229979466119079,null,"L.A20079",20079,"L.A",{"$f":"VLOOKUP(H5,[1]Sheet5!$N:$Q,4,FALSE)","v":"2015-10-18"},20.100000000000001,4,18.5,-33.4,-24.8]
["2009-10-03",14.6,5,14.2,5.0999999999999996,-14.3,null,"L.A20099",20099,"L.A",{"$f":"VLOOKUP(H6,[1]Sheet5!$N:$Q,4,FALSE)","v":"2015-10-22"},16.899999999999999,4,17.7,-21.2,-24]
["2009-10-06",7.7,2,17.5,-44.8,-29.3,null,"L.A20120",20120,"L.A",{"$f":"VLOOKUP(H7,[1]Sheet5!$N:$Q,4,FALSE)","v":"2015-10-25"},21.3,3,20.6,28.2,16.399999999999999]
["2009-10-08",11.8,2,15.8,-11,-7.6,null,"L.A20170",20170,"L.A",{"$f":"VLOOKUP(H8,[1]Sheet5!$N:$Q,4,FALSE)","v":"2015-11-02"},26.9,5,27.6,-3.2,3.5]
["2009-10-10",15.1,3,16.3,-3.9,1.9,null,"L.A20353",20353,"L.A",{"$f":"VLOOKUP(H9,[1]Sheet5!$N:$Q,4,FALSE)","v":"2015-11-28"},24.6,4,26,17.600000000000001,22.9]
["2009-10-12",9.8000000000000007,2,13.2,-21.2,-14.5,null,"L.A20794",20794,"L.A",{"$f":"VLOOKUP(H10,[1]Sheet5!$N:$Q,4,FALSE)","v":"2016-02-09"},26,6,20.7,-10.1,4]
["2009-10-15",15.2,4,13.5,-8.8000000000000007,9.5,null,"OTT20019",20019,"OTT",{"$f":"VLOOKUP(H11,[1]Sheet5!$N:$Q,4,FALSE)","v":"2015-10-10"},16,1,18.899999999999999,21.9,10.3]
["2009-10-17",12.6,3,10.7,36.299999999999997,28,null,"OTT20031",20031,"OTT",{"$f":"VLOOKUP(H12,[1]Sheet5!$N:$Q,4,FALSE)","v":"2015-10-11"},12.4,2,17.100000000000001,3.4,-3.6]
["2009-10-22",5.3,0,11.8,-1.9,2.7,null,"OTT20046",20046,"OTT",{"$f":"VLOOKUP(H13,[1]Sheet5!$N:$Q,4,FALSE)","v":"2015-10-14"},19.600000000000001,5,17,21.4,11.6]
["2009-10-24",6.9,2,11.7,-11.1,-14.8,null,"OTT20066",20066,"OTT",{"$f":"VLOOKUP(H14,[1]Sheet5!$N:$Q,4,FALSE)","v":"2015-10-17"},25,4,20.100000000000001,22,18.7]
["2009-11-28",6,1,11.6,12.6,-4,null,"OTT20094",20094,"OTT",{"$f":"VLOOKUP(H15,[1]Sheet5!$N:$Q,4,FALSE)","v":"2015-10-22"},10.199999999999999,2,16.399999999999999,-7.2,-12.9]
["2009-12-01",10.6,0,15.4,-26.1,-10.8,null,"OTT20109",20109,"OTT",{"$f":"VLOOKUP(H16,[1]Sheet5!$N:$Q,4,FALSE)","v":"2015-10-24"},21.9,4,17.7,21.9,6.1]
["2009-12-03",18.899999999999999,2,19.100000000000001,6.2,21.9,null,"OTT20149",20149,"OTT",{"$f":"VLOOKUP(H17,[1]Sheet5!$N:$Q,4,FALSE)","v":"2015-10-30"},18.7,3,14.5,20.3,17.3]
["2009-12-05",14.4,5,14.6,-27.5,-1.7,null,"OTT20376",20376,"OTT",{"$f":"VLOOKUP(H18,[1]Sheet5!$N:$Q,4,FALSE)","v":"2015-12-03"},22,2,22.8,19.600000000000001,23.8]
["2009-12-06",12.5,0,12.7,29,17.8,null,"OTT20495",20495,"OTT",{"$f":"VLOOKUP(H19,[1]Sheet5!$N:$Q,4,FALSE)","v":"2015-12-20"},14.8,5,24.8,19.600000000000001,13.5]
["2009-12-08",18.8,2,15.4,19.2,21.1,null,"OTT20553",20553,"OTT",{"$f":"VLOOKUP(H20,[1]Sheet5!$N:$Q,4,FALSE)","v":"2015-12-30"},19.8,8,19.899999999999999,6.8,1.7]
["2009-12-10",13.4,1,13,-14.2,-2.6,null,"OTT20581",20581,"OTT",{"$f":"VLOOKUP(H21,[1]Sheet5!$N:$Q,4,FALSE)","v":"2016-01-03"},19.7,5,25.1,-12.8,-5.8]
["2009-12-12",17.100000000000001,0,16.100000000000001,14.7,9.4,null,"OTT20645",20645,"OTT",{"$f":"VLOOKUP(H22,[1]Sheet5!$N:$Q,4,FALSE)","v":"2016-01-13"},17.600000000000001,4,23.2,8.1999999999999993,10.8]
["2009-12-14",9.5,4,16.899999999999999,-13.8,-17.399999999999999,null,"OTT20681",20681,"OTT",{"$f":"VLOOKUP(H23,[1]Sheet5!$N:$Q,4,FALSE)","v":"2016-01-18"},23.4,6,27.4,-2.7,18.899999999999999]
["2009-12-16",12.7,3,15.2,8.8000000000000007,5.8,null,"S.J20004",20004,"S.J",{"$f":"VLOOKUP(H24,[1]Sheet5!$N:$Q,4,FALSE)","v":"2015-10-07"},21.5,6,14.3,44.3,45.5]
["2009-12-18",3.5,0,12,-22.1,-17.899999999999999,null,"S.J20030",20030,"S.J",{"$f":"VLOOKUP(H25,[1]Sheet5!$N:$Q,4,FALSE)","v":"2015-10-10"},27.8,6,21.9,-6,-13.5]
["2009-12-19",14.6,3,11.9,-0.5,12.1,null,"S.J20040",20040,"S.J",{"$f":"VLOOKUP(H26,[1]Sheet5!$N:$Q,4,FALSE)","v":"2015-10-13"},16.2,4,14.6,-13.8,3.9]
["2009-12-21",11.4,4,16.100000000000001,-14.3,-9.6999999999999993,null,"S.J20058",20058,"S.J",{"$f":"VLOOKUP(H27,[1]Sheet5!$N:$Q,4,FALSE)","v":"2015-10-16"},16.3,4,21.8,-3.7,2.9]
["2009-12-23",16.5,2,9,12.9,8.8000000000000007,null,"S.J20071",20071,"S.J",{"$f":"VLOOKUP(H28,[1]Sheet5!$N:$Q,4,FALSE)","v":"2015-10-17"},24.6,10,22.1,6.1,21.8]
["2009-12-31",12.6,3,15.6,-3.5,-1.1000000000000001,null,"S.J20080",20080,"S.J",{"$f":"VLOOKUP(H29,[1]Sheet5!$N:$Q,4,FALSE)","v":"2015-10-19"},24.5,9,25.2,8,4.7]
["2010-01-03",17.399999999999999,4,15.7,20.7,9.3000000000000007,null,"S.J20099",20099,"S.J",{"$f":"VLOOKUP(H30,[1]Sheet5!$N:$Q,4,FALSE)","v":"2015-10-22"},17.3,6,19,3.6,-3.2]
["2010-01-05",7.7,3,17.399999999999999,-31.4,-19.7,null,"S.J20117",20117,"S.J",{"$f":"VLOOKUP(H31,[1]Sheet5!$N:$Q,4,FALSE)","v":"2015-10-24"},11.4,1,18.600000000000001,-2.4,7.7]
["2010-01-07",14.1,6,17.8,13.9,7.5,null,"S.J20155",20155,"S.J",{"$f":"VLOOKUP(H32,[1]Sheet5!$N:$Q,4,FALSE)","v":"2015-10-31"},9.1999999999999993,3,18.100000000000001,-23.1,-11.9]
["2010-01-09",15.2,2,14.2,11.8,29,null,"S.J20180",20180,"S.J",{"$f":"VLOOKUP(H33,[1]Sheet5!$N:$Q,4,FALSE)","v":"2015-11-03"},17.8,10,15.7,-19.8,4.0999999999999996]
["2010-01-10",11,3,19.2,-9.9,-8.3000000000000007,null,"S.J20193",20193,"S.J",{"$f":"VLOOKUP(H34,[1]Sheet5!$N:$Q,4,FALSE)","v":"2015-11-05"},20.9,6,21.9,7.3,13.7]
["2010-01-12",12.9,1,16.100000000000001,18.5,11.2,null,"S.J20210",20210,"S.J",{"$f":"VLOOKUP(H35,[1]Sheet5!$N:$Q,4,FALSE)","v":"2015-11-07"},13.6,5,24.3,-16.600000000000001,-18]
["2010-01-14",14.4,5,15.8,-19.100000000000001,-10.7,null,"S.J20244",20244,"S.J",{"$f":"VLOOKUP(H36,[1]Sheet5!$N:$Q,4,FALSE)","v":"2015-11-13"},9.6999999999999993,4,22.1,-25.8,-5.2]
["2010-01-16",13,2,14.3,7.3,1,null,"S.J20248",20248,"S.J",{"$f":"VLOOKUP(H37,[1]Sheet5!$N:$Q,4,FALSE)","v":"2015-11-14"},10.7,4,22.3,-39,-36.799999999999997]
["2010-01-18",21.8,7,15.2,20.9,29,null,"S.J20267",20267,"S.J",{"$f":"VLOOKUP(H38,[1]Sheet5!$N:$Q,4,FALSE)","v":"2015-11-17"},17.899999999999999,5,20.100000000000001,9.3000000000000007,0.1]
["2010-01-19",7.3,1,14.2,-6.9,-6.1,null,"S.J20329",20329,"S.J",{"$f":"VLOOKUP(H39,[1]Sheet5!$N:$Q,4,FALSE)","v":"2015-11-25"},11.6,3,19.2,18.7,4.8]
["2010-01-21",18.899999999999999,3,18,-10.7,5.0999999999999996,null,"S.J20469",20469,"S.J",{"$f":"VLOOKUP(H40,[1]Sheet5!$N:$Q,4,FALSE)","v":"2015-12-17"},23.7,8,20.7,8,0.1]
["2010-01-23",19.899999999999999,2,23,17.5,21.4,null,"S.J20498",20498,"S.J",{"$f":"VLOOKUP(H41,[1]Sheet5!$N:$Q,4,FALSE)","v":"2015-12-20"},18.899999999999999,6,24.5,-19.5,-6.6]
["2010-01-26",23.3,6,17.899999999999999,25.4,5.5,null,"S.J20653",20653,"S.J",{"$f":"VLOOKUP(H42,[1]Sheet5!$N:$Q,4,FALSE)","v":"2016-01-14"},9.5,5,18,2.5,-5.6,null,9.5,5,18,2.5,-5.6]
["2010-01-28",21.9,5,18.100000000000001,16.600000000000001,22.7,null,"S.J20669",20669,"S.J",{"$f":"VLOOKUP(H43,[1]Sheet5!$N:$Q,4,FALSE)","v":"2016-01-16"},23.8,10,22.9,13.9,6.6,null,23.8,10,22.9,13.9,6.6]
["2010-01-30",25.2,2,22.5,26.3,19.399999999999999,null,"S.J20681",20681,"S.J",{"$f":"VLOOKUP(H44,[1]Sheet5!$N:$Q,4,FALSE)","v":"2016-01-18"},23.2,8,23.8,0.5,-16.8,null,23.2,8,23.8,0.5,-16.8]
["2010-02-04",15,1,13.9,39.6,20.8]
["2010-03-02",21.1,7,22,-1.8,2.1]
["2010-03-04",21.3,5,19.899999999999999,15.1,18.8]
["2010-03-06",10.199999999999999,2,14.7,2.2999999999999998,-1]
["2010-03-09",19.399999999999999,4,12.4,29.8,16.3]
["2010-03-11",20.7,4,14.2,13.6,10.199999999999999]
["2010-03-13",5.5,1,14.1,-21.9,-8.3000000000000007]
["2010-03-16",18.600000000000001,3,18.8,-12.3,5.0999999999999996]
["2010-03-18",21.1,5,16,-3.7,-7.3]
["2010-03-20",11,3,14.9,-24.4,-9.5]
["2010-03-22",21.8,1,19.8,9.5,5.5]
["2010-03-23",8.6999999999999993,2,10.8,-5.5,-14]
["2010-03-26",14.8,3,16.7,-8.1999999999999993,-6.1]
["2010-03-27",23.2,5,19.2,34.6,24.2]
["2010-03-30",17,3,18.3,-5.9,3]
["2010-04-01",17.3,4,17.100000000000001,34.200000000000003,22.8]
{"$rows_left_out":432}